Target
Nucleotide-binding oligomerization domain-containing protein 2
Ligand
BDBM50594540
Substrate
Meas. Tech.
ChEMBL_2213471 (CHEMBL5126420)
EC50
420±n/a nM
Citation
 Guzelj, SBizjak, ?Jakopin, ? Discovery of Desmuramylpeptide NOD2 Agonists with Single-Digit Nanomolar Potency. ACS Med Chem Lett 13:1270-1277 (2022) Target
Name:
Nucleotide-binding oligomerization domain-containing protein 2
Synonyms:
CARD15 IBD1 NOD2 Nucleotide-binding oligomerization domain-containing protein 2 | nucleotide-binding oligomerization domain containing 2
Type:
PROTEIN
Mol. Mass.:
115287.18
Organism:
Homo sapiens (Human)
Description:
ChEMBL_1454053
Residue:
1040
  
Inhibitor
Name:
BDBM50594540
Synonyms:
CHEMBL5180997
Type:
Small organic molecule
Emp. Form.:
C31H39N3O9
Mol. Mass.:
597.6561
SMILES:
CCOC(=O)CC[C@@H](NC(=O)[C@H](CCc1ccccc1)NC(=O)CNC(=O)\C=C\c1ccc(O)c(OC)c1)C(=O)OCC
: