Target
Nucleotide-binding oligomerization domain-containing protein 2
Ligand
BDBM50594542
Substrate
Meas. Tech.
ChEMBL_2213471 (CHEMBL5126420)
EC50
1192±n/a nM
Citation
 Guzelj, SBizjak, ?Jakopin, ? Discovery of Desmuramylpeptide NOD2 Agonists with Single-Digit Nanomolar Potency. ACS Med Chem Lett 13:1270-1277 (2022) Target
Name:
Nucleotide-binding oligomerization domain-containing protein 2
Synonyms:
CARD15 IBD1 NOD2 Nucleotide-binding oligomerization domain-containing protein 2 | nucleotide-binding oligomerization domain containing 2
Type:
PROTEIN
Mol. Mass.:
115287.18
Organism:
Homo sapiens (Human)
Description:
ChEMBL_1454053
Residue:
1040
  
Inhibitor
Name:
BDBM50594542
Synonyms:
CHEMBL5202454
Type:
Small organic molecule
Emp. Form.:
C26H34F3N3O7
Mol. Mass.:
557.5593
SMILES:
CCOC(=O)CC[C@@H](NC(=O)[C@@H](NC(=O)CNC(=O)\C=C\c1ccc(cc1)C(F)(F)F)C(C)C)C(=O)OCC
: