Target
Nucleotide-binding oligomerization domain-containing protein 2
Ligand
BDBM50594558
Substrate
Meas. Tech.
ChEMBL_2213471 (CHEMBL5126420)
EC50
35±n/a nM
Citation
 Guzelj, SBizjak, ?Jakopin, ? Discovery of Desmuramylpeptide NOD2 Agonists with Single-Digit Nanomolar Potency. ACS Med Chem Lett 13:1270-1277 (2022) Target
Name:
Nucleotide-binding oligomerization domain-containing protein 2
Synonyms:
CARD15 IBD1 NOD2 Nucleotide-binding oligomerization domain-containing protein 2 | nucleotide-binding oligomerization domain containing 2
Type:
PROTEIN
Mol. Mass.:
115287.18
Organism:
Homo sapiens (Human)
Description:
ChEMBL_1454053
Residue:
1040
  
Inhibitor
Name:
BDBM50594558
Synonyms:
CHEMBL5187281
Type:
Small organic molecule
Emp. Form.:
C37H47N3O7
Mol. Mass.:
645.785
SMILES:
CC(C)[C@H](NC(=O)CNC(=O)\C=C\c1cccc(c1)-c1ccccc1)C(=O)N[C@H](CCC(=O)OC1CCCC1)C(=O)OC1CCCC1
: