Target
Dual specificity tyrosine-phosphorylation-regulated kinase 1B
Ligand
BDBM50434353
Substrate
Meas. Tech.
ChEMBL_2213896 (CHEMBL5127028)
IC50
0.280000±n/a nM
Citation
 Haghighijoo, ZZamani, LMoosavi, FEmami, S Therapeutic potential of quinazoline derivatives for Alzheimer's disease: A comprehensive review. Eur J Med Chem 227:0 (2022) Target
Name:
Dual specificity tyrosine-phosphorylation-regulated kinase 1B
Synonyms:
DYR1B_HUMAN Dual specificity tyrosine-phosphorylation-regulated kinase 1B MIRK
Type:
Enzyme
Mol. Mass.:
69222.24
Organism:
Homo sapiens (Human)
Description:
Q9Y463
Residue:
629
  
Inhibitor
Name:
BDBM50434353
Synonyms:
CHEMBL2386747 | US9446044, 72
Type:
Small organic molecule
Emp. Form.:
C17H11Cl2N5OS
Mol. Mass.:
404.273
SMILES:
COC(=N)c1nc2ccc3ncnc(Nc4ccc(Cl)cc4Cl)c3c2s1
: