Target
Dual specificity protein kinase CLK1
Ligand
BDBM50594785
Substrate
Meas. Tech.
ChEMBL_2214241 (CHEMBL5127373)
IC50
16±n/a nM
Citation
 Tahtouh, TDurieu, EVilliers, BBruyère, CNguyen, TLFant, XAhn, KHKhurana, LDeau, ELindberg, MFSévère, EMiege, FRoche, DLimanton, EL'Helgoual'ch, JMBurgy, GGuiheneuf, SHerault, YKendall, DACarreaux, FBazureau, JPMeijer, L Structure-Activity Relationship in the Leucettine Family of Kinase Inhibitors. J Med Chem 65:1396-1417 (2022) Target
Name:
Dual specificity protein kinase CLK1
Synonyms:
CDC-like kinase 1 Clk Protein kinase STY | Sty
Type:
PROTEIN
Mol. Mass.:
57124.52
Organism:
Mus musculus
Description:
ChEMBL_1502245
Residue:
483
  
Inhibitor
Name:
BDBM50594785
Synonyms:
CHEMBL5181008
Type:
Small organic molecule
Emp. Form.:
C17H12FN3O4
Mol. Mass.:
341.2933
SMILES:
Oc1ccc(NC2=N\C(=C/c3ccc4OCOc4c3)C(=O)N2)cc1F
: