Target
Dual specificity tyrosine-phosphorylation-regulated kinase 2
Ligand
BDBM50594782
Substrate
Meas. Tech.
ChEMBL_2214249 (CHEMBL5127381)
IC50
33±n/a nM
Citation
 Tahtouh, TDurieu, EVilliers, BBruyère, CNguyen, TLFant, XAhn, KHKhurana, LDeau, ELindberg, MFSévère, EMiege, FRoche, DLimanton, EL'Helgoual'ch, JMBurgy, GGuiheneuf, SHerault, YKendall, DACarreaux, FBazureau, JPMeijer, L Structure-Activity Relationship in the Leucettine Family of Kinase Inhibitors. J Med Chem 65:1396-1417 (2022) Target
Name:
Dual specificity tyrosine-phosphorylation-regulated kinase 2
Synonyms:
DYRK2 Dual-specificity tyrosine-phosphorylation regulated kinase 2
Type:
PROTEIN
Mol. Mass.:
66690.69
Organism:
Homo sapiens (Human)
Description:
ChEMBL_1508025
Residue:
601
  
Inhibitor
Name:
BDBM50594782
Synonyms:
CHEMBL5206744
Type:
Small organic molecule
Emp. Form.:
C16H12N4O3
Mol. Mass.:
308.2915
SMILES:
O=C1NC(Nc2ccccn2)=N\C1=C/c1ccc2OCOc2c1
: