Target
Dual specificity tyrosine-phosphorylation-regulated kinase 2
Ligand
BDBM50594784
Substrate
Meas. Tech.
ChEMBL_2214249 (CHEMBL5127381)
IC50
23±n/a nM
Citation
 Tahtouh, TDurieu, EVilliers, BBruyère, CNguyen, TLFant, XAhn, KHKhurana, LDeau, ELindberg, MFSévère, EMiege, FRoche, DLimanton, EL'Helgoual'ch, JMBurgy, GGuiheneuf, SHerault, YKendall, DACarreaux, FBazureau, JPMeijer, L Structure-Activity Relationship in the Leucettine Family of Kinase Inhibitors. J Med Chem 65:1396-1417 (2022) Target
Name:
Dual specificity tyrosine-phosphorylation-regulated kinase 2
Synonyms:
DYRK2 Dual-specificity tyrosine-phosphorylation regulated kinase 2
Type:
PROTEIN
Mol. Mass.:
66690.69
Organism:
Homo sapiens (Human)
Description:
ChEMBL_1508025
Residue:
601
  
Inhibitor
Name:
BDBM50594784
Synonyms:
CHEMBL5196066
Type:
Small organic molecule
Emp. Form.:
C17H12FN3O3
Mol. Mass.:
325.2939
SMILES:
Fc1cccc(NC2=N\C(=C/c3ccc4OCOc4c3)C(=O)N2)c1
: