Target
Histone-lysine N-methyltransferase EHMT2
Ligand
BDBM50442103
Substrate
Meas. Tech.
ChEMBL_2216552 (CHEMBL5129684)
IC50
220±n/a nM
Citation
 Park, KSXiong, YYim, HVelez, JBabault, NKumar, PLiu, JJin, J Discovery of the First-in-Class G9a/GLP Covalent Inhibitors. J Med Chem 65:10506-10522 (2022) Target
Name:
Histone-lysine N-methyltransferase EHMT2
Synonyms:
BAT8 EHMT2 G9A Histone-lysine N-methyltransferase EHMT1/EHMT2 KMT1C Protein G9a (G9a)
Type:
Enzyme
Mol. Mass.:
132339.87
Organism:
Homo sapiens (Human)
Description:
Q96KQ7
Residue:
1210
  
Inhibitor
Name:
BDBM50442103
Synonyms:
CHEMBL2441082
Type:
Small organic molecule
Emp. Form.:
C29H44F2N6O2
Mol. Mass.:
546.6955
SMILES:
COc1cc2c(NC3CCN(CC3)C(C)C)nc(nc2cc1OCCCN1CCCC1)N1CCC(F)(F)CC1
: