Target
Wee1-like protein kinase
Ligand
BDBM50240826
Substrate
Meas. Tech.
ChEMBL_2216621 (CHEMBL5129753)
IC50
22±n/a nM
Citation
 Zhang, JZhang, LWang, JOuyang, LWang, Y Polo-like Kinase 1 Inhibitors in Human Cancer Therapy: Development and Therapeutic Potential. J Med Chem 65:10133-10160 (2022) Target
Name:
Wee1-like protein kinase
Synonyms:
Serine/threonine-protein kinase WEE1 WEE1 homolog (S. pombe) | WEE1_HUMAN
Type:
PROTEIN
Mol. Mass.:
71599.12
Organism:
Homo sapiens (Human)
Description:
ChEMBL_1445054
Residue:
646
  
Inhibitor
Name:
BDBM50240826
Synonyms:
AZD-1775 US11124518, Example AZD1775 US11479555, Example AZD1775
Type:
Small organic molecule
Emp. Form.:
C27H32N8O2
Mol. Mass.:
500.5954
SMILES:
CN1CCN(CC1)c1ccc(Nc2ncc3c(n2)n(-c2cccc(n2)C(C)(C)O)n(CC=C)c3=O)cc1
: