Target
Sodium/glucose cotransporter 1
Ligand
BDBM50595440
Substrate
Meas. Tech.
ChEMBL_2216802 (CHEMBL5129934)
EC50
37±n/a nM
Citation
 Maccari, ROttaną, R Sodium-Glucose Cotransporter Inhibitors as Antidiabetic Drugs: Current Development and Future Perspectives. J Med Chem 65:10848-10881 (2022) Target
Name:
Sodium/glucose cotransporter 1
Synonyms:
High affinity sodium-glucose cotransporter Na(+)/glucose cotransporter 1 SGLT1 Sodium-dependent glucose cotransporter 1 (SGLT1) Sodium/glucose cotransporter 1 (SGLT1) | Solute carrier family 5 member 1
Type:
Protein
Mol. Mass.:
73503.78
Organism:
Homo sapiens (Human)
Description:
P13866
Residue:
664
  
Inhibitor
Name:
BDBM50595440
Synonyms:
CHEMBL5169442
Type:
Small organic molecule
Emp. Form.:
C26H30ClN3O5
Mol. Mass.:
499.987
SMILES:
CC(=O)NNC[C@H]1O[C@H]([C@H](O)[C@@H](O)[C@@H]1O)n1cc(Cc2ccc(cc2)C2CC2)c2c(Cl)cccc12
: