Target
Potassium voltage-gated channel subfamily KQT member 2/3
Ligand
BDBM50595542
Substrate
Meas. Tech.
ChEMBL_2217001 (CHEMBL5130133)
EC50
60±n/a nM
Citation
 Musella, SCarotenuto, LIraci, NBaroli, GCiaglia, TNappi, PBasilicata, MGSalviati, EBarrese, VVestuto, VPignataro, GPepe, GSommella, EDi Sarno, VManfra, MCampiglia, PGomez-Monterrey, IBertamino, ATaglialatela, MOstacolo, CMiceli, F Beyond Retigabine: Design, Synthesis, and Pharmacological Characterization of a Potent and Chemically Stable Neuronal Kv7 Channel Activator with Anticonvulsant Activity. J Med Chem 65:11340-11364 (2022) Target
Name:
Potassium voltage-gated channel subfamily KQT member 2/3
Synonyms:
Voltage-gated potassium channel subunit Kv7.2/Kv7.3 | Voltage-gated potassium channel, KQT; KCNQ2(Kv7.2)/KCNQ3(Kv7.3)
Type:
Mol. Mass.:
Description:
ASSAY_ID of EBI is 91707
Components:
This complex has 3 components.
Component 1
Name:
Potassium voltage-gated channel subfamily KQT member 2
Synonyms:
KCNQ (Kv7) potassium channel KCNQ2_HUMAN Neuroblastoma-specific potassium channel subunit alpha KvLQT2 Voltage-gated potassium channel subunit Kv7.2
Type:
PROTEIN
Mol. Mass.:
95883.20
Organism:
Homo sapiens (Human)
Description:
ChEMBL_1457496
Residue:
872
  
Component 2
Name:
Potassium voltage-gated channel subfamily KQT member 3
Synonyms:
KCNQ (Kv7) potassium channel KCNQ3_HUMAN | Voltage-gated potassium channel subunit Kv7.3
Type:
PROTEIN
Mol. Mass.:
96759.41
Organism:
Homo sapiens (Human)
Description:
ChEMBL_938652
Residue:
872
  
Inhibitor
Name:
BDBM50595542
Synonyms:
CHEMBL5204124
Type:
Small organic molecule
Emp. Form.:
C20H23F4N3O
Mol. Mass.:
397.4097
SMILES:
CC(C)(C)CC(=O)Nc1ccc(NCc2ccc(cc2)C(F)(F)F)c(F)c1N
: