Target
Adenosine receptor A2a
Ligand
BDBM50595579
Substrate
Meas. Tech.
ChEMBL_2217068 (CHEMBL5130200)
EC50
0.900000±n/a nM
Citation
 Shiriaeva, APark, DKim, GLee, YHou, XJarhad, DBKim, GYu, JHyun, YEKim, WGao, ZGJacobson, KAHan, GWStevens, RCJeong, LSChoi, SCherezov, V GPCR Agonist-to-Antagonist Conversion: Enabling the Design of Nucleoside Functional Switches for the A J Med Chem 65:11648-11657 (2022) Target
Name:
Adenosine receptor A2a
Synonyms:
A2A adenosine receptor (hA2A) ADENOSINE A2 ADORA2 Adenosine A2A receptor (A2AAR)
Type:
G Protein-Coupled Receptor (GPCR)
Mol. Mass.:
44716.46
Organism:
Homo sapiens (Human)
Description:
P29274
Residue:
412
  
Inhibitor
Name:
BDBM50595579
Synonyms:
CHEMBL5203469
Type:
Small organic molecule
Emp. Form.:
C19H21N5O3S
Mol. Mass.:
399.467
SMILES:
CCCCC#Cc1nc(N)c2nc(-c3cccs3)n([C@@H]3OC[C@@H](O)[C@H]3O)c2n1
: