Target
Adenosine receptor A3
Ligand
BDBM50170943
Substrate
Meas. Tech.
ChEMBL_303601 (CHEMBL829690)
Ki
125±n/a nM
Citation
 Baraldi, PGTabrizi, MAPreti, DBovero, AFruttarolo, FRomagnoli, RZaid, NAMoorman, ARVarani, KBorea, PA New 2-arylpyrazolo[4,3-c]quinoline derivatives as potent and selective human A3 adenosine receptor antagonists. J Med Chem 48:5001-8 (2005)  
Target
Name:
Adenosine receptor A3
Synonyms:
A3 adenosine receptor (hA3) ADORA3 | Adenosine A3 receptor (A3AR)
Type:
G Protein-Coupled Receptor (GPCR)
Mol. Mass.:
36197.32
Organism:
Homo sapiens (Human)
Description:
P0DMS8
Residue:
318
  
Inhibitor
Name:
BDBM50170943
Synonyms:
Benzyl-(2-phenyl-2H-pyrazolo[4,3-c]quinolin-4-yl)-amine | CHEMBL190612
Type:
Small organic molecule
Emp. Form.:
C23H18N4
Mol. Mass.:
350.4158
SMILES:
C(Nc1nc2ccccc2c2nn(cc12)-c1ccccc1)c1ccccc1
: