Target
Adenosine receptor A3
Ligand
BDBM50170942
Substrate
Meas. Tech.
ChEMBL_303601 (CHEMBL829690)
Ki
212±n/a nM
Citation
 Baraldi, PGTabrizi, MAPreti, DBovero, AFruttarolo, FRomagnoli, RZaid, NAMoorman, ARVarani, KBorea, PA New 2-arylpyrazolo[4,3-c]quinoline derivatives as potent and selective human A3 adenosine receptor antagonists. J Med Chem 48:5001-8 (2005)  
Target
Name:
Adenosine receptor A3
Synonyms:
A3 adenosine receptor (hA3) ADORA3 | Adenosine A3 receptor (A3AR)
Type:
G Protein-Coupled Receptor (GPCR)
Mol. Mass.:
36197.32
Organism:
Homo sapiens (Human)
Description:
P0DMS8
Residue:
318
  
Inhibitor
Name:
BDBM50170942
Synonyms:
2-Phenyl-2H-pyrazolo[4,3-c]quinoline | CHEMBL190111
Type:
Small organic molecule
Emp. Form.:
C16H11N3
Mol. Mass.:
245.2786
SMILES:
c1n(nc2c1cnc1ccccc21)-c1ccccc1
: