Target
Adenosine receptor A3
Ligand
BDBM50170946
Substrate
Meas. Tech.
ChEMBL_303507 (CHEMBL839979)
Ki
42±n/a nM
Citation
 Baraldi, PGTabrizi, MAPreti, DBovero, AFruttarolo, FRomagnoli, RZaid, NAMoorman, ARVarani, KBorea, PA New 2-arylpyrazolo[4,3-c]quinoline derivatives as potent and selective human A3 adenosine receptor antagonists. J Med Chem 48:5001-8 (2005)  
Target
Name:
Adenosine receptor A3
Synonyms:
A3 adenosine receptor (hA3) ADORA3 | Adenosine A3 receptor (A3AR)
Type:
G Protein-Coupled Receptor (GPCR)
Mol. Mass.:
36197.32
Organism:
Homo sapiens (Human)
Description:
P0DMS8
Residue:
318
  
Inhibitor
Name:
BDBM50170946
Synonyms:
2-(4-Methoxy-phenyl)-2,5-dihydro-pyrazolo[4,3-c]quinolin-4-one | CHEMBL363150
Type:
Small organic molecule
Emp. Form.:
C17H13N3O2
Mol. Mass.:
291.304
SMILES:
COc1ccc(cc1)-n1cc2c(n1)c1ccccc1[nH]c2=O
: