Target
Adenosine receptor A2a
Ligand
BDBM50170943
Substrate
Meas. Tech.
ChEMBL_303585 (CHEMBL828126)
Ki
>1000±n/a nM
Citation
 Baraldi, PGTabrizi, MAPreti, DBovero, AFruttarolo, FRomagnoli, RZaid, NAMoorman, ARVarani, KBorea, PA New 2-arylpyrazolo[4,3-c]quinoline derivatives as potent and selective human A3 adenosine receptor antagonists. J Med Chem 48:5001-8 (2005)  
Target
Name:
Adenosine receptor A2a
Synonyms:
A2A adenosine receptor (hA2A) ADENOSINE A2 ADORA2 Adenosine A2A receptor (A2AAR)
Type:
G Protein-Coupled Receptor (GPCR)
Mol. Mass.:
44716.46
Organism:
Homo sapiens (Human)
Description:
P29274
Residue:
412
  
Inhibitor
Name:
BDBM50170943
Synonyms:
Benzyl-(2-phenyl-2H-pyrazolo[4,3-c]quinolin-4-yl)-amine | CHEMBL190612
Type:
Small organic molecule
Emp. Form.:
C23H18N4
Mol. Mass.:
350.4158
SMILES:
C(Nc1nc2ccccc2c2nn(cc12)-c1ccccc1)c1ccccc1
: