Target
Adenosine receptor A2b
Ligand
BDBM50170942
Substrate
Meas. Tech.
ChEMBL_306686 (CHEMBL830020)
IC50
>1000±n/a nM
Citation
 Baraldi, PGTabrizi, MAPreti, DBovero, AFruttarolo, FRomagnoli, RZaid, NAMoorman, ARVarani, KBorea, PA New 2-arylpyrazolo[4,3-c]quinoline derivatives as potent and selective human A3 adenosine receptor antagonists. J Med Chem 48:5001-8 (2005)  
Target
Name:
Adenosine receptor A2b
Synonyms:
AA2BR_HUMAN ADORA2B Adenosine receptors A2b | Adenosine receptors; A2a & A2b
Type:
G Protein-Coupled Receptor (GPCR)
Mol. Mass.:
36341.22
Organism:
Homo sapiens (Human)
Description:
Residue:
332
  
Inhibitor
Name:
BDBM50170942
Synonyms:
2-Phenyl-2H-pyrazolo[4,3-c]quinoline | CHEMBL190111
Type:
Small organic molecule
Emp. Form.:
C16H11N3
Mol. Mass.:
245.2786
SMILES:
c1n(nc2c1cnc1ccccc21)-c1ccccc1
: