Target
Adenosine receptor A3
Ligand
BDBM50170944
Substrate
Meas. Tech.
ChEMBL_303507 (CHEMBL839979)
Ki
55±n/a nM
Citation
 Baraldi, PGTabrizi, MAPreti, DBovero, AFruttarolo, FRomagnoli, RZaid, NAMoorman, ARVarani, KBorea, PA New 2-arylpyrazolo[4,3-c]quinoline derivatives as potent and selective human A3 adenosine receptor antagonists. J Med Chem 48:5001-8 (2005)  
Target
Name:
Adenosine receptor A3
Synonyms:
A3 adenosine receptor (hA3) ADORA3 | Adenosine A3 receptor (A3AR)
Type:
G Protein-Coupled Receptor (GPCR)
Mol. Mass.:
36197.32
Organism:
Homo sapiens (Human)
Description:
P0DMS8
Residue:
318
  
Inhibitor
Name:
BDBM50170944
Synonyms:
2-Phenyl-2,5-dihydro-pyrazolo[4,3-c]quinolin-4-one | CHEMBL364319
Type:
Small organic molecule
Emp. Form.:
C16H11N3O
Mol. Mass.:
261.278
SMILES:
O=c1[nH]c2ccccc2c2nn(cc12)-c1ccccc1
: