Target
Aurora kinase B
Ligand
BDBM50273571
Substrate
Meas. Tech.
ChEMBL_2218366 (CHEMBL5131700)
IC50
250±n/a nM
Citation
 Raghuvanshi, RBharate, SB Recent Developments in the Use of Kinase Inhibitors for Management of Viral Infections. J Med Chem 65:893-921 (2022) Target
Name:
Aurora kinase B
Synonyms:
AIK2 AIM1 ARK2 AURKB_HUMAN Aurora B-INCENP Aurora kinase B (AURKB) STK-1 STK12 Serine/threonine-protein kinase aurora B
Type:
Protein
Mol. Mass.:
39327.72
Organism:
Homo sapiens (Human)
Description:
Q96GD4
Residue:
344
  
Inhibitor
Name:
BDBM50273571
Synonyms:
CHEMBL514409 N-(2-oxo-3-(phenyl(4-(piperidin-1-ylmethyl)phenylamino)methylene)indolin-5-yl)ethanesulfonamide | TCMDC-135395
Type:
Small organic molecule
Emp. Form.:
C29H32N4O3S
Mol. Mass.:
516.654
SMILES:
CCS(=O)(=O)Nc1ccc2NC(=O)C(C(=Nc3ccc(CN4CCCCC4)cc3)c3ccccc3)c2c1
: