Target
Cathepsin D
Ligand
BDBM50173730
Substrate
Meas. Tech.
ChEMBL_321034 (CHEMBL883666)
pH
4.5±n/a
Ki
>6000±n/a nM
Comments
extracted
Citation
 Ersmark, KNervall, MHamelink, EJanka, LKClemente, JCDunn, BMBlackman, MJSamuelsson, BAqvist, JHallberg, A Synthesis of malarial plasmepsin inhibitors and prediction of binding modes by molecular dynamics simulations. J Med Chem 48:6090-106 (2005)  
Target
Name:
Cathepsin D
Synonyms:
CATD_HUMAN CTSD Cathepsin D heavy chain Cathepsin D precursor
Type:
Enzyme
Mol. Mass.:
44551.72
Organism:
Homo sapiens (Human)
Description:
Human proCathepsin D (SwissProt accession number P07339) was expressed in Sf9 cells, purified, and autoactivated.
Residue:
412
  
Inhibitor
Name:
BDBM50173730
Synonyms:
(2R,3R,4R,5R)-2,5-Bis-allyloxy-3,4-dihydroxy-6-oxo-6-[N'-(3-phenyl-propionyl)-hydrazino]-hexanoic acid ((1S,2R)-2-hydroxy-indan-1-yl)-amide | CHEMBL196062
Type:
Small organic molecule
Emp. Form.:
C30H37N3O8
Mol. Mass.:
567.6301
SMILES:
O[C@H]([C@@H](O)[C@@H](OCC=C)C(=O)N[C@@H]1[C@H](O)Cc2ccccc12)[C@@H](OCC=C)C(=O)NNC(=O)CCc1ccccc1
: