Target
Cathepsin D
Ligand
BDBM50173739
Substrate
Meas. Tech.
ChEMBL_321034 (CHEMBL883666)
pH
4.5±n/a
Ki
>6000±n/a nM
Comments
extracted
Citation
 Ersmark, KNervall, MHamelink, EJanka, LKClemente, JCDunn, BMBlackman, MJSamuelsson, BAqvist, JHallberg, A Synthesis of malarial plasmepsin inhibitors and prediction of binding modes by molecular dynamics simulations. J Med Chem 48:6090-106 (2005)  
Target
Name:
Cathepsin D
Synonyms:
CATD_HUMAN CTSD Cathepsin D heavy chain Cathepsin D precursor
Type:
Enzyme
Mol. Mass.:
44551.72
Organism:
Homo sapiens (Human)
Description:
Human proCathepsin D (SwissProt accession number P07339) was expressed in Sf9 cells, purified, and autoactivated.
Residue:
412
  
Inhibitor
Name:
BDBM50173739
Synonyms:
(2R,3R,4R,5R)-2,5-Bis-((E)-3-bromo-allyloxy)-3,4-dihydroxy-6-[N'-(3-morpholin-4-yl-propionyl)-hydrazino]-6-oxo-hexanoic acid ((1S,2R)-2-hydroxy-indan-1-yl)-amide | CHEMBL197463
Type:
Small organic molecule
Emp. Form.:
C28H38Br2N4O9
Mol. Mass.:
734.431
SMILES:
O[C@H]([C@@H](O)[C@@H](OC\C=C\Br)C(=O)N[C@@H]1[C@H](O)Cc2ccccc12)[C@@H](OC\C=C\Br)C(=O)NNC(=O)CCN1CCOCC1
: