Target
Carbonic anhydrase 1
Ligand
BDBM16652
Substrate
Meas. Tech.
ChEMBL_320717 (CHEMBL881703)
Ki
3300±n/a nM
Citation
 Ozensoy, OPuccetti, LFasolis, GArslan, OScozzafava, ASupuran, CT Carbonic anhydrase inhibitors: inhibition of the tumor-associated isozymes IX and XII with a library of aromatic and heteroaromatic sulfonamides. Bioorg Med Chem Lett 15:4862-6 (2005)  
Target
Name:
Carbonic anhydrase 1
Synonyms:
CA-I CAB Carbonate dehydratase I Carbonic anhydrase 1 (CA I) Carbonic anhydrase 1 (Recombinant CA I) Carbonic anhydrase B Carbonic anhydrase I (CA I) Carbonic anhydrase I (CAI) Carbonic anhydrase isoenzyme I (hCA I) | hCA
Type:
Enzyme
Mol. Mass.:
28873.37
Organism:
Homo sapiens (Human)
Description:
P00915
Residue:
261
  
Inhibitor
Name:
BDBM16652
Synonyms:
4-Benzoylamino-benzenesulfonamide N-(4-sulfamoylphenyl)benzamide | aromatic sulfonamide compound 17
Type:
Small organic molecule
Emp. Form.:
C13H12N2O3S
Mol. Mass.:
276.311
SMILES:
NS(=O)(=O)c1ccc(NC(=O)c2ccccc2)cc1
: