Target
Carbonic anhydrase 2
Ligand
BDBM16652
Substrate
Meas. Tech.
ChEMBL_320718 (CHEMBL881704)
Ki
37±n/a nM
Citation
 Ozensoy, OPuccetti, LFasolis, GArslan, OScozzafava, ASupuran, CT Carbonic anhydrase inhibitors: inhibition of the tumor-associated isozymes IX and XII with a library of aromatic and heteroaromatic sulfonamides. Bioorg Med Chem Lett 15:4862-6 (2005)  
Target
Name:
Carbonic anhydrase 2
Synonyms:
CA-II CAC Carbonate dehydratase II Carbonic anhydrase 2 (CA-II) Carbonic anhydrase C Carbonic anhydrase II (CA-II) Carbonic anhydrase II (hCA II) | Carbonic anhydrase isoenzyme II (hCA II)
Type:
Enzyme
Mol. Mass.:
29250.71
Organism:
Homo sapiens (Human)
Description:
P00918
Residue:
260
  
Inhibitor
Name:
BDBM16652
Synonyms:
4-Benzoylamino-benzenesulfonamide N-(4-sulfamoylphenyl)benzamide | aromatic sulfonamide compound 17
Type:
Small organic molecule
Emp. Form.:
C13H12N2O3S
Mol. Mass.:
276.311
SMILES:
NS(=O)(=O)c1ccc(NC(=O)c2ccccc2)cc1
: