Target
Pyruvate kinase PKM
Ligand
BDBM50214744
Substrate
Meas. Tech.
ChEMBL_2224222 (CHEMBL5137735)
IC50
11400±n/a nM
Citation
 Arora, SJoshi, GChaturvedi, AHeuser, MPatil, SKumar, R A Perspective on Medicinal Chemistry Approaches for Targeting Pyruvate Kinase M2. J Med Chem 65:1171-1205 (2022) Target
Name:
Pyruvate kinase PKM
Synonyms:
KPYM_HUMAN PK2 PKM Pyruvate kinase (PKM2)
Type:
Protein
Mol. Mass.:
57944.31
Organism:
Homo sapiens (Human)
Description:
P14618
Residue:
531
  
Inhibitor
Name:
BDBM50214744
Synonyms:
(2E)-3-(4-hydroxy-3-methoxyphenyl)prop-2-enoic acid CHEMBL32749 ferulic acid
Type:
Small organic molecule
Emp. Form.:
C10H10O4
Mol. Mass.:
194.184
SMILES:
COc1cc(\C=C\C(O)=O)ccc1O
: