Target
Retinoic acid receptor gamma
Ligand
BDBM50101445
Substrate
Meas. Tech.
ChEMBL_320732 (CHEMBL880877)
Kd
>30000±n/a nM
Citation
 Sussman, Fde Lera, AR Ligand recognition by RAR and RXR receptors: binding and selectivity. J Med Chem 48:6212-9 (2005)  
Target
Name:
Retinoic acid receptor gamma
Synonyms:
NR1B3 RAR-gamma RARG_HUMAN Retinoic acid receptor gamma | Retinoid receptor
Type:
PROTEIN
Mol. Mass.:
50345.43
Organism:
Homo sapiens (Human)
Description:
ChEMBL_1458016
Residue:
454
  
Inhibitor
Name:
BDBM50101445
Synonyms:
(2E,4E)-3-Methyl-5-[(1S,2S)-2-methyl-2-(5,5,8,8-tetramethyl-5,6,7,8-tetrahydro-naphthalen-2-yl)-cyclopropyl]-penta-2,4-dienoic acid CHEMBL75133
Type:
Small organic molecule
Emp. Form.:
C24H32O2
Mol. Mass.:
352.5097
SMILES:
C\C(\C=C\[C@@H]1C[C@]1(C)c1ccc2c(c1)C(C)(C)CCC2(C)C)=C/C(O)=O
: