Target
Triosephosphate isomerase, glycosomal
Ligand
BDBM50597994
Substrate
Meas. Tech.
ChEMBL_2224920 (CHEMBL5138433)
IC50
11000±n/a nM
Citation
 Beltran-Hortelano, IAlcolea, VFont, MPérez-Silanes, S Examination of multiple Trypanosoma cruzi targets in a new drug discovery approach for Chagas disease. Bioorg Med Chem 58:0 (2022) Target
Name:
Triosephosphate isomerase, glycosomal
Synonyms:
TIM Triose-phosphate isomerase
Type:
PROTEIN
Mol. Mass.:
27334.70
Organism:
Trypanosoma cruzi
Description:
ChEMBL_596695
Residue:
251
  
Inhibitor
Name:
BDBM50597994
Synonyms:
CHEMBL5172018
Type:
Small organic molecule
Emp. Form.:
C13H13IO2S3
Mol. Mass.:
424.341
SMILES:
[I-].COc1ccc(cc1)-c1c\c(ss1)=[S+]\CC(C)=O
: