Target
Mitogen-activated protein kinase kinase kinase kinase 1
Ligand
BDBM50598497
Substrate
Meas. Tech.
ChEMBL_2227129 (CHEMBL5140642)
Kd
2.2±n/a nM
Citation
 Zhu, QChen, NTian, XZhou, YYou, QXu, X Hematopoietic Progenitor Kinase 1 in Tumor Immunology: A Medicinal Chemistry Perspective. J Med Chem 65:8065-8090 (2022) Target
Name:
Mitogen-activated protein kinase kinase kinase kinase 1
Synonyms:
HPK1 MAP4K1
Type:
PROTEIN
Mol. Mass.:
91316.07
Organism:
Homo sapiens (Human)
Description:
ChEMBL_586597
Residue:
833
  
Inhibitor
Name:
BDBM50598497
Synonyms:
CHEMBL5206785
Type:
Small organic molecule
Emp. Form.:
C22H23N7O2
Mol. Mass.:
417.4637
SMILES:
Cn1cc(Nc2ncc(nc2C(N)=O)C2=CCC[C@H](C2)NC(=O)c2ccccc2)cn1
: