Target
Amyloid-beta precursor protein
Ligand
BDBM50598539
Substrate
Meas. Tech.
ChEMBL_2227272 (CHEMBL5140785)
Kd
13100±n/a nM
Citation
 Rai, HGupta, SKumar, SYang, JSingh, SKRan, CModi, G Near-Infrared Fluorescent Probes as Imaging and Theranostic Modalities for Amyloid-Beta and Tau Aggregates in Alzheimer's Disease. J Med Chem 65:8550-8595 (2022) Target
Name:
Amyloid-beta precursor protein
Synonyms:
A4 ABPP AICD-50 AICD-59 AID(57) APP Alzheimer disease amyloid protein Amyloid beta Protein Amyloid beta protein Abeta(1-42) Amyloid intracellular domain 57 Amyloid protein (Abeta42b) Beta amyloid A4 protein Beta-APP42 Beta-amyloid protein 42 C83 CVAP Gamma Secretase Gamma-CTF(57) Gamma-secretase Gamma-secretase C-terminal fragment 57 P3(40) PN-II Protease nexin-II S-APP-beta Soluble APP-beta | beta-Amyloid Precursor Protein (APP)
Type:
Single-pass type I membrane protein
Mol. Mass.:
86890.41
Organism:
Homo sapiens (Human)
Description:
P05067
Residue:
770
  
Inhibitor
Name:
BDBM50598539
Synonyms:
CHEMBL5196550
Type:
Small organic molecule
Emp. Form.:
C29H29IN2O2
Mol. Mass.:
564.4572
SMILES:
[I-].COCCOCCn1c2ccccc2c2cc(\C=C\c3cc[n+](C)c4ccccc34)ccc12
: