Target
Cytochrome c oxidase subunit 2
Ligand
BDBM50598752
Substrate
Meas. Tech.
ChEMBL_2227920 (CHEMBL5141433)
IC50
3010±n/a nM
Citation
 Li, JHu, XZhang, HPeng, YLi, SXiong, YJiang, WWang, Z -2-(Phenylamino) Benzamide Derivatives as Dual Inhibitors of COX-2 and Topo I Deter Gastrointestinal Cancers via Targeting Inflammation and Tumor Progression. J Med Chem 65:10481-10505 (2022) Target
Name:
Cytochrome c oxidase subunit 2
Synonyms:
COII COX2_HUMAN MT-CO2 | MTCO2
Type:
PROTEIN
Mol. Mass.:
25555.66
Organism:
Homo sapiens (Human)
Description:
ChEMBL_530099
Residue:
227
  
Inhibitor
Name:
BDBM50598752
Synonyms:
CHEMBL5178874
Type:
Small organic molecule
Emp. Form.:
C21H18Cl2N2O2
Mol. Mass.:
401.286
SMILES:
Cc1ccc(Cl)c(Nc2ccccc2C(=O)NCc2ccc(O)cc2)c1Cl
: