Target
Cytochrome c oxidase subunit 2
Ligand
BDBM35905
Substrate
Meas. Tech.
ChEMBL_2227920 (CHEMBL5141433)
IC50
1410±n/a nM
Citation
 Li, JHu, XZhang, HPeng, YLi, SXiong, YJiang, WWang, Z -2-(Phenylamino) Benzamide Derivatives as Dual Inhibitors of COX-2 and Topo I Deter Gastrointestinal Cancers via Targeting Inflammation and Tumor Progression. J Med Chem 65:10481-10505 (2022) Target
Name:
Cytochrome c oxidase subunit 2
Synonyms:
COII COX2_HUMAN MT-CO2 | MTCO2
Type:
PROTEIN
Mol. Mass.:
25555.66
Organism:
Homo sapiens (Human)
Description:
ChEMBL_530099
Residue:
227
  
Inhibitor
Name:
BDBM35905
Synonyms:
Tolfenamic acid flufenamic acid analogue, 32
Type:
Small organic molecule
Emp. Form.:
C14H12ClNO2
Mol. Mass.:
261.704
SMILES:
Cc1c(Cl)cccc1Nc1ccccc1C(O)=O
: