Target
Indoleamine 2,3-dioxygenase 1
Ligand
BDBM309529
Substrate
Meas. Tech.
ChEMBL_2228733 (CHEMBL5142246)
IC50
370±n/a nM
Citation
 Zhang, YLi, YChen, XChen, XChen, CWang, LDong, XWang, GGu, RLi, FHan, FChen, D Discovery of 1-(Hetero)aryl-?-carboline Derivatives as IDO1/TDO Dual Inhibitors with Antidepressant Activity. J Med Chem 65:11214-11228 (2022) Target
Name:
Indoleamine 2,3-dioxygenase 1
Synonyms:
I23O1_HUMAN IDO-1 INDO Indoleamine 2,3-dioxygenase | Indoleamine-pyrrole 2,3-dioxygenase
Type:
Enzyme
Mol. Mass.:
45330.80
Organism:
Homo sapiens (Human)
Description:
P14902
Residue:
403
  
Inhibitor
Name:
BDBM309529
Synonyms:
3-(5-fluoro-1H-indol-3- yl)pyrrolidine-2,5-dione US9603836, Compound 1 US9949951, 1a
Type:
Small organic molecule
Emp. Form.:
C12H9FN2O2
Mol. Mass.:
232.2105
SMILES:
Fc1ccc2[nH]cc(C3CC(=O)NC3=O)c2c1
: