Target
Peroxisome proliferator-activated receptor alpha
Ligand
BDBM50176615
Substrate
Meas. Tech.
ChEMBL_327488 (CHEMBL862360)
EC50
58±n/a nM
Citation
 Lowe, DBBifulco, NBullock, WHClaus, TCoish, PDai, MDela Cruz, FEDickson, DFan, DHoover-Litty, HLi, TMa, XMannelly, GMonahan, MKMuegge, IO'Connor, SRodriguez, MShelekhin, TStolle, ASweet, LWang, MWang, YZhang, CZhang, HJZhang, MZhao, KZhao, QZhu, JZhu, LTsutsumi, M Substituted indanylacetic acids as PPAR-alpha-gamma activators. Bioorg Med Chem Lett 16:297-301 (2005)  
Target
Name:
Peroxisome proliferator-activated receptor alpha
Synonyms:
NR1C1 PPAR PPAR-alpha PPARA_HUMAN Peroxisome proliferator-activated receptor | Peroxisome proliferator-activated receptor alpha (PPAR alpha)
Type:
Enzyme
Mol. Mass.:
52222.08
Organism:
Homo sapiens (Human)
Description:
Q07869
Residue:
468
  
Inhibitor
Name:
BDBM50176615
Synonyms:
2-(5-(2-(5-methyl-2-phenyloxazol-4-yl)ethoxy)-6-phenyl-2,3-dihydro-1H-inden-1-yl)butanoic acid | CHEMBL201280
Type:
Small organic molecule
Emp. Form.:
C31H31NO4
Mol. Mass.:
481.5821
SMILES:
CCC(C1CCc2cc(OCCc3nc(oc3C)-c3ccccc3)c(cc12)-c1ccccc1)C(O)=O
: