Target
Peroxisome proliferator-activated receptor gamma
Ligand
BDBM50176625
Substrate
Meas. Tech.
ChEMBL_327489 (CHEMBL861781)
EC50
>10000±n/a nM
Citation
 Lowe, DBBifulco, NBullock, WHClaus, TCoish, PDai, MDela Cruz, FEDickson, DFan, DHoover-Litty, HLi, TMa, XMannelly, GMonahan, MKMuegge, IO'Connor, SRodriguez, MShelekhin, TStolle, ASweet, LWang, MWang, YZhang, CZhang, HJZhang, MZhao, KZhao, QZhu, JZhu, LTsutsumi, M Substituted indanylacetic acids as PPAR-alpha-gamma activators. Bioorg Med Chem Lett 16:297-301 (2005)  
Target
Name:
Peroxisome proliferator-activated receptor gamma
Synonyms:
NR1C3 PPAR-gamma PPARG_HUMAN Peroxisome proliferator-activated receptor gamma (PPAR gamma) Peroxisome proliferator-activated receptor gamma (PPARĪ³) peroxisome proliferator-activated receptor gamma isoform 2
Type:
Nuclear Receptor
Mol. Mass.:
57613.46
Organism:
Homo sapiens (Human)
Description:
P37231
Residue:
505
  
Inhibitor
Name:
BDBM50176625
Synonyms:
2-(5-(2-(1-oxophthalazin-2(1H)-yl)ethoxy)-2,3-dihydro-1H-inden-1-yl)butanoic acid | CHEMBL200611
Type:
Small organic molecule
Emp. Form.:
C23H24N2O4
Mol. Mass.:
392.4477
SMILES:
CCC(C1CCc2cc(OCCn3ncc4ccccc4c3=O)ccc12)C(O)=O
: