Target
Peroxisome proliferator-activated receptor gamma
Ligand
BDBM50176637
Substrate
Meas. Tech.
ChEMBL_327489 (CHEMBL861781)
EC50
46±n/a nM
Citation
 Lowe, DBBifulco, NBullock, WHClaus, TCoish, PDai, MDela Cruz, FEDickson, DFan, DHoover-Litty, HLi, TMa, XMannelly, GMonahan, MKMuegge, IO'Connor, SRodriguez, MShelekhin, TStolle, ASweet, LWang, MWang, YZhang, CZhang, HJZhang, MZhao, KZhao, QZhu, JZhu, LTsutsumi, M Substituted indanylacetic acids as PPAR-alpha-gamma activators. Bioorg Med Chem Lett 16:297-301 (2005)  
Target
Name:
Peroxisome proliferator-activated receptor gamma
Synonyms:
NR1C3 PPAR-gamma PPARG_HUMAN Peroxisome proliferator-activated receptor gamma (PPAR gamma) Peroxisome proliferator-activated receptor gamma (PPARĪ³) peroxisome proliferator-activated receptor gamma isoform 2
Type:
Nuclear Receptor
Mol. Mass.:
57613.46
Organism:
Homo sapiens (Human)
Description:
P37231
Residue:
505
  
Inhibitor
Name:
BDBM50176637
Synonyms:
(S)-2-((S)-5-(2-(2-(3,4-dichlorophenyl)-5-methyloxazol-4-yl)ethoxy)-2,3-dihydro-1H-inden-1-yl)butanoic acid | CHEMBL372404
Type:
Small organic molecule
Emp. Form.:
C25H25Cl2NO4
Mol. Mass.:
474.376
SMILES:
CC[C@@H]([C@@H]1CCc2cc(OCCc3nc(oc3C)-c3ccc(Cl)c(Cl)c3)ccc12)C(O)=O
: