Target
Peroxisome proliferator-activated receptor alpha
Ligand
BDBM50176655
Substrate
Meas. Tech.
ChEMBL_327488 (CHEMBL862360)
EC50
5480±n/a nM
Citation
 Lowe, DBBifulco, NBullock, WHClaus, TCoish, PDai, MDela Cruz, FEDickson, DFan, DHoover-Litty, HLi, TMa, XMannelly, GMonahan, MKMuegge, IO'Connor, SRodriguez, MShelekhin, TStolle, ASweet, LWang, MWang, YZhang, CZhang, HJZhang, MZhao, KZhao, QZhu, JZhu, LTsutsumi, M Substituted indanylacetic acids as PPAR-alpha-gamma activators. Bioorg Med Chem Lett 16:297-301 (2005)  
Target
Name:
Peroxisome proliferator-activated receptor alpha
Synonyms:
NR1C1 PPAR PPAR-alpha PPARA_HUMAN Peroxisome proliferator-activated receptor | Peroxisome proliferator-activated receptor alpha (PPAR alpha)
Type:
Enzyme
Mol. Mass.:
52222.08
Organism:
Homo sapiens (Human)
Description:
Q07869
Residue:
468
  
Inhibitor
Name:
BDBM50176655
Synonyms:
2-(5-(2-(2-(2,4-dichlorophenyl)-5-methyloxazol-4-yl)ethoxy)-2,3-dihydro-1H-inden-1-yl)butanoic acid | CHEMBL199372
Type:
Small organic molecule
Emp. Form.:
C25H25Cl2NO4
Mol. Mass.:
474.376
SMILES:
CCC(C1CCc2cc(OCCc3nc(oc3C)-c3ccc(Cl)cc3Cl)ccc12)C(O)=O
: