Target
N-lysine methyltransferase SMYD2
Ligand
BDBM50075102
Substrate
Meas. Tech.
ChEMBL_2230265 (CHEMBL5144037)
IC50
425±n/a nM
Citation
 Dhorma, LPTeli, MKNangunuri, BGVenkanna, ARagam, RMaturi, AMirzaei, AVo, DKMaeng, HJKim, MH Positioning of an unprecedented 1,5-oxaza spiroquinone scaffold into SMYD2 inhibitors in epigenetic space. Eur J Med Chem 227:0 (2022) Target
Name:
N-lysine methyltransferase SMYD2
Synonyms:
HSKM-B KMT3C N-lysine methyltransferase SMYD2 SET and MYND domain-containing protein 2 (SMYD2) SMYD2_HUMAN
Type:
Enzyme
Mol. Mass.:
49689.57
Organism:
Homo sapiens (Human)
Description:
Q9NRG4
Residue:
433
  
Inhibitor
Name:
BDBM50075102
Synonyms:
CHEMBL3414623
Type:
Small organic molecule
Emp. Form.:
C36H42N6O
Mol. Mass.:
574.7583
SMILES:
Cc1cn(CCN2CCN(CC2)c2ccccc2-c2cc(cc(c2)C(=O)NCCCN2CCCC2)C#N)c2ccccc12
: