Target
GTPase KRas
Ligand
BDBM50514402
Substrate
Meas. Tech.
ChEMBL_2231968 (CHEMBL5145740)
Ki
86000±n/a nM
Citation
 Zheng, QPeacock, DMShokat, KM Drugging the Next Undruggable KRAS Allele-Gly12Asp. J Med Chem 65:3119-3122 (2022) Target
Name:
GTPase KRas
Synonyms:
GTPase KRas, N-terminally processed KRAS Ki-Ras RASK_HUMAN c-Ki-ras
Type:
PROTEIN
Mol. Mass.:
21656.10
Organism:
Homo sapiens (Human)
Description:
ChEMBL_1476955
Residue:
189
  
Inhibitor
Name:
BDBM50514402
Synonyms:
CHEMBL4535757 | US11345701, Compound Amg-510
Type:
Small organic molecule
Emp. Form.:
C30H30F2N6O3
Mol. Mass.:
560.5944
SMILES:
CC(C)c1nccc(C)c1-n1c2nc(c(F)cc2c(nc1=O)N1CCN(C[C@@H]1C)C(=O)C=C)-c1c(O)cccc1F
: