Target
Voltage-dependent calcium channel subunit alpha-2/delta-1
Ligand
BDBM50178453
Substrate
Meas. Tech.
ChEMBL_332923 (CHEMBL854074)
IC50
179±n/a nM
Citation
 Chen, CStearns, BHu, TAnker, NSantini, AArruda, JMCampbell, BTDatta, PAiyar, JMunoz, B Expedited SAR study of high-affinity ligands to the alpha(2)delta subunit of voltage-gated calcium channels: Generation of a focused library using a solution-phase Sn2Ar coupling methodology. Bioorg Med Chem Lett 16:746-9 (2005)  
Target
Name:
Voltage-dependent calcium channel subunit alpha-2/delta-1
Synonyms:
CA2D1_HUMAN CACNL2A MHS3 Voltage-dependent calcium channel subunit delta-1 Voltage-gated calcium channel alpha2/delta subunit 1 | Voltage-gated calcium channel subunit alpha-2/delta-1
Type:
Enzyme
Mol. Mass.:
124544.88
Organism:
Homo sapiens (Human)
Description:
P54289
Residue:
1103
  
Inhibitor
Name:
BDBM50178453
Synonyms:
6-(4-ethoxyphenyl)-N,4,5,7-tetramethyl-N-(2-(pyridin-2-yl)ethyl)-6H-pyrrolo[3,4-d]pyridazin-1-amine | CHEMBL201100
Type:
Small organic molecule
Emp. Form.:
C25H29N5O
Mol. Mass.:
415.5307
SMILES:
CCOc1ccc(cc1)-n1c(C)c2c(C)nnc(N(C)CCc3ccccn3)c2c1C
: