Target
Retinoic acid receptor RXR-gamma
Ligand
BDBM50179116
Substrate
Meas. Tech.
ChEMBL_349701 (CHEMBL865142)
Ki
10±n/a nM
Citation
 Farmer, LJMarron, KSCanan Koch, SSHwang, CKKallel, EAZhi, LNadzan, AMRobertson, DWBennani, YL Aza-retinoids as novel retinoid X receptor-specific agonists. Bioorg Med Chem Lett 16:2352-6 (2006)  
Target
Name:
Retinoic acid receptor RXR-gamma
Synonyms:
NR2B3 RXRG Retinoic acid receptor RXR-gamma Retinoid X receptor gamma/retinoic acid receptor alpha
Type:
PROTEIN
Mol. Mass.:
50878.26
Organism:
Homo sapiens (Human)
Description:
ChEMBL_197216
Residue:
463
  
Inhibitor
Name:
BDBM50179116
Synonyms:
(2E,4E)-6-((6-tert-butyl-1,1-dimethyl-2,3-dihydro-1H-inden-4-yl)(propyl)amino)-3-methylhexa-2,4-dienoic acid | CHEMBL208316
Type:
Small organic molecule
Emp. Form.:
C25H37NO2
Mol. Mass.:
383.5668
SMILES:
CCCN(C\C=C\C(\C)=C\C(O)=O)c1cc(cc2c1CCC2(C)C)C(C)(C)C
: