Target
Retinoic acid receptor RXR-beta
Ligand
BDBM50179127
Substrate
Meas. Tech.
ChEMBL_349699 (CHEMBL866290)
Ki
327±n/a nM
Citation
 Farmer, LJMarron, KSCanan Koch, SSHwang, CKKallel, EAZhi, LNadzan, AMRobertson, DWBennani, YL Aza-retinoids as novel retinoid X receptor-specific agonists. Bioorg Med Chem Lett 16:2352-6 (2006)  
Target
Name:
Retinoic acid receptor RXR-beta
Synonyms:
NR2B2 RXRB Retinoic acid receptor RXR-beta Retinoid receptor
Type:
PROTEIN
Mol. Mass.:
56932.89
Organism:
Homo sapiens (Human)
Description:
ChEMBL_39045
Residue:
533
  
Inhibitor
Name:
BDBM50179127
Synonyms:
(2E,4E)-6-((6-tert-butyl-1,1-dimethyl-2,3-dihydro-1H-inden-4-yl)(3-methylbut-2-enyl)amino)-3-methylhexa-2,4-dienoic acid | CHEMBL204789
Type:
Small organic molecule
Emp. Form.:
C27H39NO2
Mol. Mass.:
409.6041
SMILES:
[#6]\[#6](-[#6])=[#6]\[#6]-[#7](-[#6]\[#6]=[#6]\[#6](\[#6])=[#6]\[#6](-[#8])=O)-c1cc(cc2c1-[#6]-[#6]C2([#6])[#6])C([#6])([#6])[#6]
: