Target
Retinoic acid receptor RXR-alpha
Ligand
BDBM50179118
Substrate
Meas. Tech.
ChEMBL_349697 (CHEMBL866288)
Ki
21±n/a nM
Citation
 Farmer, LJMarron, KSCanan Koch, SSHwang, CKKallel, EAZhi, LNadzan, AMRobertson, DWBennani, YL Aza-retinoids as novel retinoid X receptor-specific agonists. Bioorg Med Chem Lett 16:2352-6 (2006)  
Target
Name:
Retinoic acid receptor RXR-alpha
Synonyms:
NR2B1 Nuclear receptor subfamily 4 group A member 2 RXRA Retinoic acid receptor RXR-alpha/gamma Retinoid receptor
Type:
PROTEIN
Mol. Mass.:
50820.38
Organism:
Homo sapiens (Human)
Description:
ChEMBL_1456363
Residue:
462
  
Inhibitor
Name:
BDBM50179118
Synonyms:
(S,2E,4E)-3-methyl-5-(1-(5,5,8,8-tetramethyl-5,6,7,8-tetrahydronaphthalen-2-yl)pyrrolidin-2-yl)penta-2,4-dienoic acid | CHEMBL378926
Type:
Small organic molecule
Emp. Form.:
C24H33NO2
Mol. Mass.:
367.5243
SMILES:
C\C(\C=C\[C@@H]1CCCN1c1ccc2c(c1)C(C)(C)CCC2(C)C)=C/C(O)=O
: