Target
Retinoic acid receptor RXR-alpha
Ligand
BDBM50179115
Substrate
Meas. Tech.
ChEMBL_349697 (CHEMBL866288)
Ki
63±n/a nM
Citation
 Farmer, LJMarron, KSCanan Koch, SSHwang, CKKallel, EAZhi, LNadzan, AMRobertson, DWBennani, YL Aza-retinoids as novel retinoid X receptor-specific agonists. Bioorg Med Chem Lett 16:2352-6 (2006)  
Target
Name:
Retinoic acid receptor RXR-alpha
Synonyms:
NR2B1 Nuclear receptor subfamily 4 group A member 2 RXRA Retinoic acid receptor RXR-alpha/gamma Retinoid receptor
Type:
PROTEIN
Mol. Mass.:
50820.38
Organism:
Homo sapiens (Human)
Description:
ChEMBL_1456363
Residue:
462
  
Inhibitor
Name:
BDBM50179115
Synonyms:
(2E,4E)-6-((6-tert-butyl-1,1-dimethyl-2,3-dihydro-1H-inden-4-yl)(cyclopropylmethyl)amino)-3-methylhexa-2,4-dienoic acid | CHEMBL377178
Type:
Small organic molecule
Emp. Form.:
C26H37NO2
Mol. Mass.:
395.5775
SMILES:
C\C(\C=C\CN(CC1CC1)c1cc(cc2c1CCC2(C)C)C(C)(C)C)=C/C(O)=O
: