Target
Retinoic acid receptor RXR-alpha
Ligand
BDBM50179129
Substrate
Meas. Tech.
ChEMBL_349697 (CHEMBL866288)
Ki
122±n/a nM
Citation
 Farmer, LJMarron, KSCanan Koch, SSHwang, CKKallel, EAZhi, LNadzan, AMRobertson, DWBennani, YL Aza-retinoids as novel retinoid X receptor-specific agonists. Bioorg Med Chem Lett 16:2352-6 (2006)  
Target
Name:
Retinoic acid receptor RXR-alpha
Synonyms:
NR2B1 Nuclear receptor subfamily 4 group A member 2 RXRA Retinoic acid receptor RXR-alpha/gamma Retinoid receptor
Type:
PROTEIN
Mol. Mass.:
50820.38
Organism:
Homo sapiens (Human)
Description:
ChEMBL_1456363
Residue:
462
  
Inhibitor
Name:
BDBM50179129
Synonyms:
(2E,4E)-6-((3,5-di-tert-butylphenyl)(octyl)amino)-3-methylhexa-2,4-dienoic acid | CHEMBL205894
Type:
Small organic molecule
Emp. Form.:
C29H47NO2
Mol. Mass.:
441.689
SMILES:
CCCCCCCCN(C\C=C\C(\C)=C\C(O)=O)c1cc(cc(c1)C(C)(C)C)C(C)(C)C
: