Target
Retinoic acid receptor RXR-gamma
Ligand
BDBM50179128
Substrate
Meas. Tech.
ChEMBL_349701 (CHEMBL865142)
Ki
207±n/a nM
Citation
 Farmer, LJMarron, KSCanan Koch, SSHwang, CKKallel, EAZhi, LNadzan, AMRobertson, DWBennani, YL Aza-retinoids as novel retinoid X receptor-specific agonists. Bioorg Med Chem Lett 16:2352-6 (2006)  
Target
Name:
Retinoic acid receptor RXR-gamma
Synonyms:
NR2B3 RXRG Retinoic acid receptor RXR-gamma Retinoid X receptor gamma/retinoic acid receptor alpha
Type:
PROTEIN
Mol. Mass.:
50878.26
Organism:
Homo sapiens (Human)
Description:
ChEMBL_197216
Residue:
463
  
Inhibitor
Name:
BDBM50179128
Synonyms:
(2E,4E)-6-(benzyl(3,5-di-tert-butylphenyl)amino)-3-methylhexa-2,4-dienoic acid | CHEMBL208529
Type:
Small organic molecule
Emp. Form.:
C28H37NO2
Mol. Mass.:
419.5989
SMILES:
C\C(\C=C\CN(Cc1ccccc1)c1cc(cc(c1)C(C)(C)C)C(C)(C)C)=C/C(O)=O
: