Target
Retinoic acid receptor RXR-gamma
Ligand
BDBM50179121
Substrate
Meas. Tech.
ChEMBL_349701 (CHEMBL865142)
Ki
211±n/a nM
Citation
 Farmer, LJMarron, KSCanan Koch, SSHwang, CKKallel, EAZhi, LNadzan, AMRobertson, DWBennani, YL Aza-retinoids as novel retinoid X receptor-specific agonists. Bioorg Med Chem Lett 16:2352-6 (2006)  
Target
Name:
Retinoic acid receptor RXR-gamma
Synonyms:
NR2B3 RXRG Retinoic acid receptor RXR-gamma Retinoid X receptor gamma/retinoic acid receptor alpha
Type:
PROTEIN
Mol. Mass.:
50878.26
Organism:
Homo sapiens (Human)
Description:
ChEMBL_197216
Residue:
463
  
Inhibitor
Name:
BDBM50179121
Synonyms:
(2E,4E)-3-methyl-6-((3,5,5,8,8-pentamethyl-5,6,7,8-tetrahydronaphthalen-2-yl)(propyl)amino)hexa-2,4-dienoic acid | CHEMBL205532
Type:
Small organic molecule
Emp. Form.:
C25H37NO2
Mol. Mass.:
383.5668
SMILES:
CCCN(C\C=C\C(\C)=C\C(O)=O)c1cc2c(cc1C)C(C)(C)CCC2(C)C
: