Target
Bile salt-activated lipase
Ligand
BDBM50084233
Substrate
Meas. Tech.
ChEMBL_325182 (CHEMBL861460)
Ki
580±n/a nM
Citation
 Pietsch, MGütschow, M Synthesis of tricyclic 1,3-oxazin-4-ones and kinetic analysis of cholesterol esterase and acetylcholinesterase inhibition. J Med Chem 48:8270-88 (2005)  
Target
Name:
Bile salt-activated lipase
Synonyms:
CEL Cholesterol esterase
Type:
PROTEIN
Mol. Mass.:
65152.77
Organism:
Bos taurus
Description:
ChEMBL_154778
Residue:
597
  
Inhibitor
Name:
BDBM50084233
Synonyms:
2-Diethylamino-6,7-dihydro-5H-cyclopenta[4,5]thieno[2,3-d][1,3]oxazin-4-one | CHEMBL150472
Type:
Small organic molecule
Emp. Form.:
C13H16N2O2S
Mol. Mass.:
264.343
SMILES:
CCN(CC)c1nc2sc3CCCc3c2c(=O)o1
: