Target
Bile salt-activated lipase
Ligand
BDBM50084229
Substrate
Meas. Tech.
ChEMBL_325182 (CHEMBL861460)
Ki
1640±n/a nM
Citation
 Pietsch, MGütschow, M Synthesis of tricyclic 1,3-oxazin-4-ones and kinetic analysis of cholesterol esterase and acetylcholinesterase inhibition. J Med Chem 48:8270-88 (2005)  
Target
Name:
Bile salt-activated lipase
Synonyms:
CEL Cholesterol esterase
Type:
PROTEIN
Mol. Mass.:
65152.77
Organism:
Bos taurus
Description:
ChEMBL_154778
Residue:
597
  
Inhibitor
Name:
BDBM50084229
Synonyms:
2-Diethylamino-5-methyl-5,6,7,8-tetrahydro-benzo[4,5]thieno[2,3-d][1,3]oxazin-4-one | CHEMBL151182
Type:
Small organic molecule
Emp. Form.:
C15H20N2O2S
Mol. Mass.:
292.397
SMILES:
CCN(CC)c1nc2sc3CCCC(C)c3c2c(=O)o1
: