Target
Bile salt-activated lipase
Ligand
BDBM50179326
Substrate
Meas. Tech.
ChEMBL_325182 (CHEMBL861460)
Ki
4300±n/a nM
Citation
 Pietsch, MGütschow, M Synthesis of tricyclic 1,3-oxazin-4-ones and kinetic analysis of cholesterol esterase and acetylcholinesterase inhibition. J Med Chem 48:8270-88 (2005)  
Target
Name:
Bile salt-activated lipase
Synonyms:
CEL Cholesterol esterase
Type:
PROTEIN
Mol. Mass.:
65152.77
Organism:
Bos taurus
Description:
ChEMBL_154778
Residue:
597
  
Inhibitor
Name:
BDBM50179326
Synonyms:
2-(diethylamino)-5,6-dimethyl-4H-thieno[2,3-d][1,3]oxazin-4-one CHEMBL444837
Type:
Small organic molecule
Emp. Form.:
C12H16N2O2S
Mol. Mass.:
252.333
SMILES:
CCN(CC)c1nc2sc(C)c(C)c2c(=O)o1
: