Target
Bile salt-activated lipase
Ligand
BDBM50179321
Substrate
Meas. Tech.
ChEMBL_325182 (CHEMBL861460)
Ki
>50000±n/a nM
Citation
 Pietsch, MGütschow, M Synthesis of tricyclic 1,3-oxazin-4-ones and kinetic analysis of cholesterol esterase and acetylcholinesterase inhibition. J Med Chem 48:8270-88 (2005)  
Target
Name:
Bile salt-activated lipase
Synonyms:
CEL Cholesterol esterase
Type:
PROTEIN
Mol. Mass.:
65152.77
Organism:
Bos taurus
Description:
ChEMBL_154778
Residue:
597
  
Inhibitor
Name:
BDBM50179321
Synonyms:
7-benzoyl-5,6,7,8-tetrahydro-2-(dimethylamino)-4H-pyrido[4',3':4,5]thieno[2,3-d][1,3]oxazin-4-one | CHEMBL109867
Type:
Small organic molecule
Emp. Form.:
C18H17N3O3S
Mol. Mass.:
355.411
SMILES:
CN(C)c1nc2sc3CN(CCc3c2c(=O)o1)C(=O)c1ccccc1
: