Target
Tumor necrosis factor receptor superfamily member 16
Ligand
BDBM50180054
Substrate
Meas. Tech.
ChEMBL_329948 (CHEMBL868809)
Ki
>10000±n/a nM
Citation
 Kumar, JSMajo, VJHsiung, SCMillak, MSLiu, KPTamir, HPrabhakaran, JSimpson, NRVan Heertum, RLMann, JJParsey, RV Synthesis and in vivo validation of [O-methyl-11C]2-{4-[4-(7-methoxynaphthalen-1-yl)piperazin- 1-yl]butyl}-4-methyl-2H-[1,2,4]triazine-3,5-dione: a novel 5-HT1A receptor agonist positron emission tomography ligand. J Med Chem 49:125-34 (2006)  
Target
Name:
Tumor necrosis factor receptor superfamily member 16
Synonyms:
CD_antigen=CD271 Low affinity neurotrophin receptor p75NTR NGF receptor TNFRSF16 Tumor necrosis factor receptor superfamily member 16 | p75 ICD
Type:
PROTEIN
Mol. Mass.:
45159.83
Organism:
Homo sapiens (Human)
Description:
ChEMBL_346884
Residue:
427
  
Inhibitor
Name:
BDBM50180054
Synonyms:
CHEMBL199824 | [O-methyl-11C]2-{4-[4-(7-methoxynaphthalen-1-yl)piperazin-1-yl]butyl}-4-methyl-2H-[1,2,4]triazine-3,5-dione
Type:
Small organic molecule
Emp. Form.:
C23H29N5O3
Mol. Mass.:
423.5081
SMILES:
COc1ccc2cccc(N3CCN(CCCCn4ncc(=O)n(C)c4=O)CC3)c2c1
: